{"text_format":"1","workbook":"xlsx","n_sheets":11,"sheets":["Introduction","Assumptions","Finish Summary","Risk Analysis","Finish Input","Feed Input","Feed-Summary","Finish-Worksheet","Finish-O","Weaner-O","Ingredient-Summary"],"not_rendered":{"charts":0,"images":3,"macros":1,"external_links":0,"defined_names":43,"comments":1,"pivot_tables":0},"unopened":[],"bounds":{"document_bytes":16777216,"sheet_cells":100000,"rows_first":2000,"rows_last":500,"rows_between":2000,"halvings":0,"cell_chars":16384,"cell_head_chars":4096},"cells_cut":0,"cells_raw":0,"read":"whole","date_system":"1900"}

{"sheet":"Introduction","index":0,"n_rows":57,"n_cols":7,"rows_kept":57,"cut":false,"hidden":false,"merged":[[5,1,5,7],[4,1,4,7],[6,1,6,7],[16,1,25,8],[27,1,38,8],[56,1,58,8]]}
[]
[]
[". . . . . . . . . . . . . . . . . . . . . . . . . . . . . . . . . . . . . . . . . . . . . . . . . "]
[]
[null,"Guidelines For Estimating"]
[null,"Swine (26 to 121 kg) Finishing Costs"]
[null,{"$f":"\"Based On Marketing \"&FIXED('Finish Input'!G36,0)&\" Pigs \"","v":"Based On Marketing 11,376 Pigs "}]
[]
[]
[]
[]
[null,null,null,null,null,"Date:","April, 2023"]
[]
[]
[]
[]
[null,"This guide is designed to provide you with planning information and a format for calculating costs of production of a swine finishing 26 to 121 kg enterprise  in Manitoba.  This type of  operation is intended to represent the third stage of a three stage pork  system.  General Manitoba Agriculture recommendations are assumed in using feed and veterinary inputs. These figures provide an economic evaluation of the livestock and estimated prices required to cover all costs.  Costs include labour, investment and depreciation, but do not include management costs, nor do they necessarily represent the average cost of production in Manitoba."]
[]
[]
[]
{"$rows_left_out":38}
{"sheet":"Assumptions","index":1,"n_rows":23,"n_cols":1,"rows_kept":23,"cut":false,"hidden":false,"merged":[[18,0,20,0],[22,0,26,0],[14,0,16,0],[10,0,12,0],[4,0,8,0]]}
[]
["Swine (26 to 121 kg) Finishing Cost of Production"]
[]
[]
[{"$f":"\"The following 26 to 121 kg budget is based on the assumption that all feed is purchased or home-mixed. The budget includes a land investment cost for \"&'Finish Input'!G161&\" acres, with \"&'Finish Input'!G162&\" acres rented out at $\"&'Finish Input'!G163&\" per acre, of the estimated \"&ROUND(((('Finish-Worksheet'!D133*'Finish Input'!F140)/(40.768*2))*2.4709661),0)&\" to \"&ROUND(((('Finish-Worksheet'!D133*'Finish Input'!F140)/(26.362*2))*2.4709661),0)&\" acres of total landbase that would be required for this size of livestock operation.  This land base falls within the 2XP2O5 application rate, soil phosphorus levels permitting.\"","v":"The following 26 to 121 kg budget is based on the assumption that all feed is purchased or home-mixed. The budget includes a land investment cost for 40 acres, with 0 acres rented out at $60 per acre, of the estimated 232 to 358 acres of total landbase that would be required for this size of livestock operation.  This land base falls within the 2XP2O5 application rate, soil phosphorus levels permitting."}]
[]
[]
[]
[]
[]
[{"$f":"\"The budget includes an assumption that 1.5% of the market pigs are sold as lightweight pigs. It is assumed that when light weight pigs are sold, they will have a salvage value. Therefore, total marketings are reduced by \"&'Finish Input'!H35&\"% to compensate for the lightweight pigs.\"","v":"The budget includes an assumption that 1.5% of the market pigs are sold as lightweight pigs. It is assumed that when light weight pigs are sold, they will have a salvage value. Therefore, total marketings are reduced by 2.44% to compensate for the lightweight pigs."}]
[]
[]
[]
["The budget includes an assumption that this particular operation is \"all-in, all-out\" by room. Space allocations for finishing pigs are in accordance with Recommended Code of Practice for the Care and Handling of Farm Animals: Pigs."]
[]
[]
[]
["The rations illustrated in this budget are examples only. Individual farm conditions should be taken into account when formulating the diets. Producers need to know the feed intakes of their animals. Please consult with a nutritionist for diet information suggestions."]
[]
{"$rows_left_out":4}
{"sheet":"Finish Summary","index":2,"n_rows":68,"n_cols":11,"rows_kept":68,"cut":false,"hidden":false,"merged":[[0,0,0,11],[1,0,1,11],[2,4,2,5],[2,7,2,8],[67,0,69,10],[43,0,43,10]]}
[{"$f":"\"Swine (26 to 121 kg) Finishing Summary - \"&Introduction!G12","v":"Swine (26 to 121 kg) Finishing Summary - April, 2023"}]
[]
[null,null,null,null,"Purchased Feed",null,null,"Home-Mixed Feed"]
[null,null,null,null,"$/Pig","Total",null,"$/Pig","Total",null,"Your "]
["A. Operating Costs",null,null,null,"Sold","Cost",null,"Sold","Cost",null,"Cost"]
["1.","Feed Costs:"]
[null,"1.01 Grower 1",null,null,{"$f":"'Finish-Worksheet'!D17","v":33.549999999999997},{"$f":"ROUND(E7*'Finish Input'!$G$36,0)","v":381681},null,{"$f":"'Finish-Worksheet'!D47","v":24.1},{"$f":"ROUND(H7*'Finish Input'!$G$36,0)","v":274173}]
[null,"1.02 Grower 2",null,null,{"$f":"'Finish-Worksheet'!D27","v":87.1},{"$f":"ROUND(E8*'Finish Input'!$G$36,0)","v":990891},null,{"$f":"'Finish-Worksheet'!D57","v":68.87},{"$f":"ROUND(H8*'Finish Input'!$G$36,0)","v":783498}]
["","1.03 Finisher ",null,null,{"$f":"'Finish-Worksheet'!D37","v":42.91},{"$f":"ROUND(E9*'Finish Input'!$G$36,0)","v":488164},null,{"$f":"'Finish-Worksheet'!D67","v":29.61},{"$f":"ROUND(H9*'Finish Input'!$G$36,0)","v":336857}]
["Total Feed Cost",null,null,null,{"$f":"SUM(E7:E9)","v":163.56},{"$f":"SUM(F7:F9)","v":1860736},null,{"$f":"SUM(H7:H9)","v":122.58},{"$f":"SUM(I7:I9)","v":1394528}]
[]
["2.","Other Operating Costs:"]
[null,"2.01 Weanling Cost",null,null,{"$f":"'Finish-Worksheet'!D78","v":89.39},{"$f":"ROUND(E13*'Finish Input'!$G$36,0)","v":1016943},null,{"$f":"E13","v":89.39},{"$f":"F13","v":1016943}]
[null,"2.02 Veterinary Medicine & Supplies",null,null,{"$f":"'Finish-Worksheet'!D84","v":1.4679419583836519},{"$f":"ROUND(E14*'Finish Input'!$G$36,0)","v":16700},null,{"$f":"E14","v":1.4679419583836519},{"$f":"F14","v":16700}]
[null,"2.03 Maintenance & Repairs",null,null,{"$f":"'Finish-Worksheet'!D90","v":2.4263586259908565},{"$f":"ROUND(E15*'Finish Input'!$G$36,0)","v":27603},null,2.4263586259908565,27603]
[null,"2.04 Hydro & Propane",null,null,{"$f":"'Finish-Worksheet'!D96","v":3.6169386648844619},{"$f":"ROUND(E16*'Finish Input'!$G$36,0)","v":41148},null,3.6169386648844619,41148]
[null,"2.05 Insurance",null,null,{"$f":"'Finish-Worksheet'!D118","v":2.5484004619999987},{"$f":"ROUND(E17*'Finish Input'!$G$36,0)","v":28992},null,2.5484004619999987,28992]
[null,"2.06 Manure Costs",null,null,{"$f":"'Finish-Worksheet'!D164","v":2.231130670752397},{"$f":"ROUND(E18*'Finish Input'!$G$36,0)","v":25382},null,2.231130670752397,25382]
[null,"2.07 Office Supplies",null,null,{"$f":"'Finish-Worksheet'!D170","v":0.1051246446434741},{"$f":"ROUND(E19*'Finish Input'!$G$36,0)","v":1196},null,0.1051246446434741,1196]
[null,"2.08 Marketing & Transport",null,null,{"$f":"'Finish-Worksheet'!D179","v":9.6100000000000012},{"$f":"ROUND(E20*'Finish Input'!$G$36,0)","v":109328},null,9.6100000000000012,109328]
{"$rows_left_out":49}
{"sheet":"Risk Analysis","index":3,"n_rows":60,"n_cols":7,"rows_kept":60,"cut":false,"hidden":false,"merged":[[59,0,61,6],[0,0,0,6],[37,0,37,6],[39,2,39,6],[46,0,46,6],[48,2,48,6]]}
["Risk & Sensitivity Analysis (Stress Test)"]
["A.  Operating Costs"]
[null,"Feed cost",{"$f":"'Finish Summary'!E10","v":163.56},{"$f":"'Finish Summary'!H10","v":122.58}]
[null,"Weanling cost",{"$f":"'Finish Summary'!E13","v":89.39},{"$f":"'Finish Summary'!H13","v":89.39}]
[null,"Other Operating Costs",{"$f":"SUM('Finish Summary'!E24-'Finish Summary'!E13-'Finish Summary'!E10)","v":28.115623218005908},{"$f":"SUM('Finish Summary'!H24-'Finish Summary'!H13-'Finish Summary'!H10)","v":27.528711026225082}]
[null,"Subtotal",{"$f":"SUM(C3:C5)","v":281.0656232180059},{"$f":"SUM(D3:D5)","v":239.49871102622507}]
["B.  Fixed Costs",null,{"$f":"'Finish Summary'!E37","v":14.033751730193744},{"$f":"'Finish Summary'!H37","v":14.830283846531115}]
["C.  Labour",null,{"$f":"'Finish Summary'!E40","v":5.9238050574485674},{"$f":"'Finish Summary'!H40","v":5.9238050574485674}]
["Total Costs",null,{"$f":"SUM(C6:C8)","v":301.02318000564821},{"$f":"SUM(D6:D8)","v":260.25279993020473}]
[]
["Estimated Farmgate"]
[null,"Price ($ per 100kg)",{"$f":"'Finish Input'!E12","v":202},{"$f":"'Finish Input'!E12","v":202}]
[]
[]
[null,"Percent Market Price Change",-0.1]
[null,"Percent Feed Cost Change",0.1]
[null,"Percent Weanling Cost Change",0.05]
[]
[]
[null,null,"Purchased Feed","Home-Mixed Feed"]
{"$rows_left_out":41}
{"sheet":"Finish Input","index":4,"n_rows":169,"n_cols":11,"rows_kept":169,"cut":false,"hidden":false,"merged":[[1,0,1,11],[88,0,88,10],[86,0,87,10],[54,4,54,7],[41,7,41,8]]}
[]
["Swine (26-121 kg) Finishing Production Cost Assumptions"]
[]
[""]
["1.","This input table outlines the cost of production for a finishing enterprise"]
["2.","Buildings and equipment are valued at new cost."]
["3.","Purchased or home-mixed feed is used."]
["4.","Manure haulage is contracted out."]
[]
[null,null,"Weanling Cost based on ",null,null,87]
[null,null,"$1 Canadian Dollar",null,0.74,null,"USD     or $1 USD =",{"$f":"SUM(1/E11)","v":1.3513513513513513},"Canadian Dollar"]
[null,null,"Market Price/100kg",null,202,"  or:",{"$f":"E12/100/2.2046","v":0.91626598929511016}," /lb",110,"Market Index"]
[null,null,"Premium/head",null,2,null,"Basis ($ per 100kg)",15,80,"% Dress"]
[null,null,"Estimated US Futures Price",null,null,{"$f":"SUM((E12+H13)/2.2046)/H11","v":72.838610178717218},"USD"]
[]
["Indicators of Productivity"]
[null,null,null,null,null,null,"Grower 1","Grower 2","Finisher",null,"Total"]
["Number of Pigs Purchased",null,null,null,null,null,12000,{"$f":"G24","v":11886},{"$f":"H24","v":11773},null,{"$f":"G18","v":12000}]
["Average Beginning Weight (kg)",null,null,null,null,null,26,{"$f":"G20","v":50},{"$f":"H20","v":100},null,{"$f":"G19","v":26}]
["Average Ending Weight (kg)",null,null,null,null,null,50,100,121,null,{"$f":"I20","v":121}]
{"$rows_left_out":150}
{"sheet":"Feed Input","index":5,"n_rows":79,"n_cols":7,"rows_kept":79,"cut":false,"hidden":false,"merged":[[1,0,1,6]]}
[]
["Feed Ingredient Costs"]
[]
[null,null,null,null,"Price/tonne",null,"Your Cost"]
[null,"  Wheat",null,null,370]
[null,"  Barley",null,null,320]
[null,"  Corn ",null,null,355]
[null,"  Soybean Meal - 47 % ",null,null,665]
[null,"  Canola Meal - 34 % ",null,null,425]
[null,"  Peas",null,null,390]
[null,"  Grower Micro Premix",null,null,6000]
[null,"  Canola Oil ",null,null,2400]
[null,"  Whey Powder ",null,null,1364.6]
[null,"  Herring Meal",null,null,3364.4]
[null,"  Plasma",null,null,5720]
[null,"  Limestone ",null,null,203.95]
[null,"  Dical (16% Ca-21% P) ",null,null,1524.23]
[null,"  Salt - 96% ",null,null,261.89999999999998]
[null,"  Phytase",null,null,14500]
[null,"  L-Lysine HCL ",null,null,2248.5]
{"$rows_left_out":60}
{"sheet":"Feed-Summary","index":6,"n_rows":77,"n_cols":10,"rows_kept":77,"cut":false,"hidden":false,"merged":[[0,0,0,9]]}
["Home-Mixed Feed Requirement and Cost Summary"]
[null,null,null,null,null,"Ingredient",null,"Ration"]
[null,null,null,"Amount",null,"    Price",null,"Cost"]
["Grower 1",null,null,"       (kg)",null,"($ /tonne)",null,"($ /tonne)",null,"Your Cost"]
[{"$f":"'Feed Input'!B32","v":"  Wheat"},null,null,{"$f":"IF('Feed Input'!D32=0,\"\",'Feed Input'!D32)","v":475},null,{"$f":"IF('Feed Input'!D32=0,\" \",'Feed Input'!E5)","v":370},null,{"$f":"IF('Feed Input'!D32=0,\" \",ROUND((D5/1000)*F5,2))","v":175.75}]
[{"$f":"'Feed Input'!B33","v":"  Barley"},null,null,{"$f":"IF('Feed Input'!D33=0,\"\",'Feed Input'!D33)","v":215},null,{"$f":"IF('Feed Input'!D33=0,\" \",'Feed Input'!E6)","v":320},null,{"$f":"IF('Feed Input'!D33=0,\" \",ROUND((D6/1000)*F6,2))","v":68.8}]
[{"$f":"'Feed Input'!B34","v":"  Corn "},null,null,{"$f":"IF('Feed Input'!D34=0,\"\",'Feed Input'!D34)","v":""},null,{"$f":"IF('Feed Input'!D34=0,\" \",'Feed Input'!E7)","v":" "},null,{"$f":"IF('Feed Input'!D34=0,\" \",ROUND((D7/1000)*F7,2))","v":" "}]
[{"$f":"'Feed Input'!B35","v":"  Soybean Meal - 47 % "},null,null,{"$f":"IF('Feed Input'!D35=0,\"\",'Feed Input'!D35)","v":175},null,{"$f":"IF('Feed Input'!D35=0,\" \",'Feed Input'!E8)","v":665},null,{"$f":"IF('Feed Input'!D35=0,\" \",ROUND((D8/1000)*F8,2))","v":116.38}]
[{"$f":"'Feed Input'!B36","v":"  Canola Meal - 34 % "},null,null,{"$f":"IF('Feed Input'!D36=0,\"\",'Feed Input'!D36)","v":""},null,{"$f":"IF('Feed Input'!D36=0,\" \",'Feed Input'!E9)","v":" "},null,{"$f":"IF('Feed Input'!D36=0,\" \",ROUND((D9/1000)*F9,2))","v":" "}]
[{"$f":"'Feed Input'!B37","v":"  Peas"},null,null,{"$f":"IF('Feed Input'!D37=0,\"\",'Feed Input'!D37)","v":100},null,{"$f":"IF('Feed Input'!D37=0,\" \",'Feed Input'!E10)","v":390},null,{"$f":"IF('Feed Input'!D37=0,\" \",ROUND((D10/1000)*F10,2))","v":39}]
[{"$f":"'Feed Input'!B38","v":"  Grower Micro Premix"},null,null,{"$f":"IF('Feed Input'!D38=0,\"\",'Feed Input'!D38)","v":3},null,{"$f":"IF('Feed Input'!D38=0,\" \",'Feed Input'!E11)","v":6000},null,{"$f":"IF('Feed Input'!D38=0,\" \",ROUND((D11/1000)*F11,2))","v":18}]
[{"$f":"'Feed Input'!B39","v":"  Canola Oil "},null,null,{"$f":"IF('Feed Input'!D39=0,\"\",'Feed Input'!D39)","v":10},null,{"$f":"IF('Feed Input'!D39=0,\" \",'Feed Input'!E12)","v":2400},null,{"$f":"IF('Feed Input'!D39=0,\" \",ROUND((D12/1000)*F12,2))","v":24}]
[{"$f":"'Feed Input'!B40","v":"  Whey Powder "},null,null,{"$f":"IF('Feed Input'!D40=0,\"\",'Feed Input'!D40)","v":""},null,{"$f":"IF('Feed Input'!D40=0,\" \",'Feed Input'!E13)","v":" "},null,{"$f":"IF('Feed Input'!D40=0,\" \",ROUND((D13/1000)*F13,2))","v":" "}]
[{"$f":"'Feed Input'!B41","v":"  Herring Meal"},null,null,{"$f":"IF('Feed Input'!D41=0,\"\",'Feed Input'!D41)","v":""},null,{"$f":"IF('Feed Input'!D41=0,\" \",'Feed Input'!E14)","v":" "},null,{"$f":"IF('Feed Input'!D41=0,\" \",ROUND((D14/1000)*F14,2))","v":" "}]
[{"$f":"'Feed Input'!B42","v":"  Plasma"},null,null,{"$f":"IF('Feed Input'!D42=0,\"\",'Feed Input'!D42)","v":""},null,{"$f":"IF('Feed Input'!D42=0,\" \",'Feed Input'!E15)","v":" "},null,{"$f":"IF('Feed Input'!D42=0,\" \",ROUND((D15/1000)*F15,2))","v":" "}]
[{"$f":"'Feed Input'!B43","v":"  Limestone "},null,null,{"$f":"IF('Feed Input'!D43=0,\"\",'Feed Input'!D43)","v":12},null,{"$f":"IF('Feed Input'!D43=0,\" \",'Feed Input'!E16)","v":203.95},null,{"$f":"IF('Feed Input'!D43=0,\" \",ROUND((D16/1000)*F16,2))","v":2.4500000000000002}]
[{"$f":"'Feed Input'!B44","v":"  Dical (16% Ca-21% P) "},null,null,{"$f":"IF('Feed Input'!D44=0,\"\",'Feed Input'!D44)","v":5},null,{"$f":"IF('Feed Input'!D44=0,\" \",'Feed Input'!E17)","v":1524.23},null,{"$f":"IF('Feed Input'!D44=0,\" \",ROUND((D17/1000)*F17,2))","v":7.62}]
[{"$f":"'Feed Input'!B45","v":"  Salt - 96% "},null,null,{"$f":"IF('Feed Input'!D45=0,\"\",'Feed Input'!D45)","v":3.5},null,{"$f":"IF('Feed Input'!D45=0,\" \",'Feed Input'!E18)","v":261.89999999999998},null,{"$f":"IF('Feed Input'!D45=0,\" \",ROUND((D18/1000)*F18,2))","v":0.92}]
[{"$f":"'Feed Input'!B46","v":"  Phytase"},null,null,{"$f":"IF('Feed Input'!D46=0,\"\",'Feed Input'!D46)","v":0.5},null,{"$f":"IF('Feed Input'!D46=0,\" \",'Feed Input'!E19)","v":14500},null,{"$f":"IF('Feed Input'!D46=0,\" \",ROUND((D19/1000)*F19,2))","v":7.25}]
[{"$f":"'Feed Input'!B47","v":"  L-Lysine HCL "},null,null,{"$f":"IF('Feed Input'!D47=0,\"\",'Feed Input'!D47)","v":1},null,{"$f":"IF('Feed Input'!D47=0,\" \",'Feed Input'!E20)","v":2248.5},null,{"$f":"IF('Feed Input'!D47=0,\" \",ROUND((D20/1000)*F20,2))","v":2.25}]
{"$rows_left_out":58}
{"sheet":"Finish-Worksheet","index":7,"n_rows":328,"n_cols":9,"rows_kept":328,"cut":false,"hidden":false,"merged":[[1,0,1,8]]}
[null,null,null,null,""]
["Swine Finishing Production Cost Worksheet"]
[]
[]
["A.  Operating Costs",null,null,null,null,null,null,null,"Your Cost"]
[]
["1. Feed Requirements and Costs"]
[]
[null,1.01,"  Grower 1 - Purchased Feed"]
[null,null,null,{"$f":"'Finish Input'!G25","v":24},null," kg weight gain/pig"]
[null,null,"x",{"$f":"'Finish Input'!G23","v":1.95},null," feed conversion ratio"]
[null,null,"=",{"$f":"D10*D11","v":46.8},null," kg ration/pig"]
[null,null,"x",{"$f":"'Finish Input'!H44","v":679.58},null," /tonne ration"]
[null,null,"÷",1000,null," kg/tonne"]
[null,null,"x",{"$f":"'Finish Input'!$G$18","v":12000},null," weanlings purchased"]
[null,null,"÷",{"$f":"'Finish Input'!$G$36","v":11376.471600000001},null," pigs sold"]
[null,null,"=",{"$f":"ROUND(((D12*D13/1000)*D15)/D16,2)","v":33.549999999999997},null," /pig sold"]
[null,null,""]
[null,1.02,"  Grower 2 - Purchased Feed"]
[null,null,null,{"$f":"'Finish Input'!H25","v":50},null," kg weight gain/pig"]
{"$rows_left_out":309}
{"sheet":"Finish-O","index":8,"n_rows":60,"n_cols":11,"rows_kept":60,"cut":false,"hidden":true,"merged":[]}
[]
[]
[null,"============================================================================="]
[null,"","","GROWING AND FINISHING PIG PRODUCTION SUMMARY"]
[null,"","","",null,"","","","","",""]
[null,"============================================================================="]
[null,"A. OPERATING COSTS",null,null,null,null,"","","TOTAL","$/HOG SOLD","$/PLACE"]
[null,"","1.","Feed Costs:",null,null,null,"","-----------------------------------------------------------------------"]
[null,"","","1.01","Grower Ration #1",null,null,null,{"$f":"J9*'Finish Input'!G34","v":637273.65},{"$f":"ROUND('Finish Input'!G44*SUM('Finish Input'!H44:I44)/1000,2)","v":54.65},{"$f":"J9*'Finish Input'!G34/'Finish Input'!K28","v":159.85826261219825}]
[null,null,null,"1.02","Grower Ration #2",null,null,null,{"$f":"J10*'Finish Input'!G34","v":1724195.4600000002},{"$f":"ROUND('Finish Input'!G45*SUM('Finish Input'!H45:I45)/1000,2)","v":147.86000000000001},{"$f":"J10*'Finish Input'!G34/'Finish Input'!K28","v":432.50947319011226}]
[null,"","","1.02","Finisher Ration",null,null,null,{"$f":"J11*'Finish Input'!G34","v":801693.75},{"$f":"ROUND('Finish Input'!G46*SUM('Finish Input'!H46:I46)/1000,2)","v":68.75},{"$f":"J11*'Finish Input'!G34/'Finish Input'!K28","v":201.10257190464097}]
[null,"","","","",null,null,null,"=================================================="]
[null,"","","Total Feed Cost",null,null,null,null,{"$f":"SUM(I9:I12)","v":3163162.8600000003},{"$f":"SUM(J9:J12)","v":271.26},{"$f":"SUM(K9:K12)","v":793.47030770695153}]
[null,"","","","",null,null,null,"","",""]
[null,"","2.","Other Operating Costs:",null,null,null,null,"","",""]
[null,"","","2.01","Weanling Cost **",null,null,null,{"$f":"J16*'Finish Input'!G34","v":687600},{"$f":"'Finish Input'!G107*'Finish Input'!G32/'Finish Input'!G34","v":58.965783380499097},{"$f":"J16*'Finish Input'!G34/'Finish Input'!K28","v":172.48248279549534}]
[null,"","","2.02","Veterinary Cost",null,null,null,{"$f":"J17*'Finish Input'!G34","v":191999997.53999999},{"$f":"ROUND('Finish Input'!G112*'Finish Input'!G18/'Finish Input'!G34,2)","v":16465.14},{"$f":"J17*'Finish Input'!G34/'Finish Input'!K28","v":48162.647283926985}]
[null,"","","2.03","Maintenance & Repairs",null,null,null,{"$f":"J18*'Finish Input'!G34","v":27636.57},{"$f":"ROUND('Finish Input'!G114*'Finish Input'!H74/'Finish Input'!G34/100,2)","v":2.37},{"$f":"J18*'Finish Input'!G34/'Finish Input'!K28","v":6.9325541151127146}]
[null,"","","B7","Hydro (Heat)",null,null,null,{"$f":"J19*'Finish Input'!G34","v":{"$error":"#REF!"}},{"$f":"ROUND('Finish Input'!#REF!*'Finish Input'!#REF!*'Finish Input'!K28/'Finish Input'!G34,2)","v":{"$error":"#REF!"}},{"$f":"J19*'Finish Input'!G34/'Finish Input'!K28","v":{"$error":"#REF!"}}]
[null,"","","2.05","Insurance",null,null,null,{"$f":"J20*'Finish Input'!G34","v":20062.853628536286},{"$f":"'Finish-Worksheet'!D103","v":1.7205088438844254},{"$f":"J20*'Finish Input'!G34/'Finish Input'!K28","v":5.0327091416703764}]
{"$rows_left_out":41}
{"sheet":"Weaner-O","index":9,"n_rows":63,"n_cols":10,"rows_kept":63,"cut":false,"hidden":true,"merged":[]}
[]
[]
[null,"============================================================================="]
[null,"","WEANER PIG PRODUCTION COST SUMMARY",null,null,null,null,null,"",""]
[null,"","","","","","","","",""]
[null,"============================================================================="]
[null,"A.","OPERATING COSTS",null,null,null,null,"     TOTAL","$/HOG SOLD","$/SOW/YR"]
[null,"","1.","Feed Costs:",null,"","","------------------------------------------------------------------------"]
[null,"","","A1","Sow Lactation Ration",null,null,{"$f":"ROUND(#REF!*#REF!*#REF!*#REF!/1000*#REF!,2)","v":{"$error":"#REF!"}},{"$f":"ROUND(J9/'Finish Input'!$H$34,2)","v":{"$error":"#REF!"}},{"$f":"ROUND(#REF!*#REF!*#REF!*#REF!/1000,2)","v":{"$error":"#REF!"}}]
[null,"","","1.02","Sow Gestation Ration",null,null,{"$f":"ROUND((365-#REF!*#REF!)*#REF!*#REF!/1000*#REF!,2)","v":{"$error":"#REF!"}},{"$f":"ROUND(J10/'Finish Input'!$H$34,2)","v":{"$error":"#REF!"}},{"$f":"ROUND((365-#REF!*#REF!)*#REF!*#REF!/1000,2)","v":{"$error":"#REF!"}}]
[null,"","","1.03","Boar Ration",null,null,{"$f":"ROUND(365*#REF!*#REF!/1000*#REF!/#REF!*#REF!,2)","v":{"$error":"#REF!"}},{"$f":"ROUND(J11/'Finish Input'!$H$34,2)","v":{"$error":"#REF!"}},{"$f":"ROUND(365*#REF!*#REF!/1000*#REF!/#REF!,2)","v":{"$error":"#REF!"}}]
[null,"","","1.04","Creep Feed",null,null,{"$f":"ROUND(#REF!*#REF!/1000*#REF!*#REF!,2)","v":{"$error":"#REF!"}},{"$f":"ROUND(J12/'Finish Input'!$H$34,2)","v":{"$error":"#REF!"}},{"$f":"ROUND(#REF!*#REF!/1000*#REF!,2)","v":{"$error":"#REF!"}}]
[null,"","","1.05","Starter Ration #1",null,null,{"$f":"ROUND(#REF!*#REF!/1000*#REF!*#REF!,2)","v":{"$error":"#REF!"}},{"$f":"ROUND(J13/'Finish Input'!$H$34,2)","v":{"$error":"#REF!"}},{"$f":"ROUND(#REF!*#REF!/1000*#REF!,2)","v":{"$error":"#REF!"}}]
[null,null,null,"1.05","Starter Ration #2",null,null,{"$f":"ROUND(#REF!*#REF!/1000*#REF!*#REF!,2)","v":{"$error":"#REF!"}},{"$f":"ROUND(J14/'Finish Input'!$H$34,2)","v":{"$error":"#REF!"}},{"$f":"ROUND(#REF!*#REF!/1000*#REF!,2)","v":{"$error":"#REF!"}}]
[null,"","","","","","","===================================="]
[null,"","","Total Feed Cost",null,null,null,{"$f":"J16*#REF!","v":{"$error":"#REF!"}},{"$f":"ROUND(J16/'Finish Input'!$H$34,2)","v":{"$error":"#REF!"}},{"$f":"SUM(J8:J15)","v":{"$error":"#REF!"}}]
[null,"","","","",null,null,"","",""]
[null,"","2.","Other Operating Costs:",null,null,null,"","",""]
[null,"","","A7","Vet. Medicine & Supplies:",null,null,"","",""]
[null,"","","","    Professional Services",null,null,{"$f":"J20*#REF!","v":{"$error":"#REF!"}},{"$f":"ROUND(J20/'Finish Input'!$H$34,2)","v":{"$error":"#REF!"}},{"$f":"ROUND(#REF!,2)","v":{"$error":"#REF!"}}]
{"$rows_left_out":44}
{"sheet":"Ingredient-Summary","index":10,"n_rows":36,"n_cols":8,"rows_kept":36,"cut":false,"hidden":false,"merged":[[12,1,12,7],[1,0,1,8]]}
[]
["Summary of Purchased Feeds Used"]
[null,null,{"$f":"'Finish Input'!G34","v":11661},"Pigs available for marketing (includes lightweights)"]
[]
[null,null,null,null,"Total per","Total","Total","Total per"]
[null,null,null,null,"Pig Mkt","per Year","per Month","Pig Mkt"]
[null,null,null,null,"(kgs)","(tonnes)","(tonnes)","(lbs)"]
[null,{"$f":"'Finish Input'!A44","v":"    Grower 1"},null,null,{"$f":"'Finish Input'!G44","v":46.8},{"$f":"(E8*$C$3)/1000","v":545.73479999999995},{"$f":"F8/12","v":45.477899999999998},{"$f":"E8*2.2046","v":103.17528}]
[null,{"$f":"'Finish Input'!A45","v":"    Grower 2"},null,null,{"$f":"'Finish Input'!G45","v":150},{"$f":"(E9*$C$3)/1000","v":1749.15},{"$f":"F9/12","v":145.76250000000002},{"$f":"E9*2.2046","v":330.69}]
[null,{"$f":"'Finish Input'!A46","v":"    Finisher Ration"},null,null,{"$f":"'Finish Input'!G46","v":73.5},{"$f":"(E10*$C$3)/1000","v":857.08349999999996},{"$f":"F10/12","v":71.423625000000001},{"$f":"E10*2.2046","v":162.03810000000001}]
[null,"    Total",null,null,{"$f":"SUM(E8:E10)","v":270.3},{"$f":"SUM(F8:F10)","v":3151.9682999999995},{"$f":"SUM(G8:G10)","v":262.66402500000004},{"$f":"SUM(H8:H10)","v":595.90337999999997}]
[]
[null,"  Summary of Home-Mixed Feed Ingredients Used"]
[null,null,null,null,"Total","Total","Total","Total"]
[null," ",null,null,"per Pig","per Year","per Month","per Pig"]
[null,null,null,null,"(kgs)","(tonnes)","(tonnes)","(lbs)"]
[null,{"$f":"'Feed Input'!B5","v":"  Wheat"},null,null,{"$f":"'Feed Input'!G58","v":52.230000000000004},{"$f":"(E17*$C$3)/1000","v":609.05403000000001},{"$f":"F17/12","v":50.754502500000001},{"$f":"E17*2.2046","v":115.14625800000002}]
[null,{"$f":"'Feed Input'!B6","v":"  Barley"},null,null,{"$f":"'Feed Input'!G59","v":160.911},1876.3831710000002,{"$f":"F18/12","v":156.36526425000002},{"$f":"E18*2.2046","v":354.74439060000003}]
[null,{"$f":"'Feed Input'!B7","v":"  Corn "},null,null,{"$f":"'Feed Input'!G60","v":0},0,0,0]
[null,{"$f":"'Feed Input'!B8","v":"  Soybean Meal - 47 % "},null,null,{"$f":"'Feed Input'!G61","v":19.439999999999998},226.68983999999998,18.890819999999998,42.857423999999995]
{"$rows_left_out":16}