{"text_format":"1","workbook":"xlsx","n_sheets":9,"sheets":["Introduction","Assumptions","Farrow-Wean Summary","Risk Analysis","Farrow-Wean Input","Feed-Cost","Feed-Summary","Weaner-Worksheet","Ingredient-Summary"],"not_rendered":{"charts":0,"images":3,"macros":1,"external_links":0,"defined_names":33,"comments":1,"pivot_tables":0},"unopened":[],"bounds":{"document_bytes":16777216,"sheet_cells":100000,"rows_first":2000,"rows_last":500,"rows_between":2000,"halvings":0,"cell_chars":16384,"cell_head_chars":4096},"cells_cut":0,"cells_raw":0,"read":"whole","date_system":"1900"}

{"sheet":"Introduction","index":0,"n_rows":51,"n_cols":8,"rows_kept":51,"cut":false,"hidden":false,"merged":[[50,1,52,8],[4,1,4,8],[5,1,5,8],[6,1,6,8],[54,1,55,8],[11,1,20,8],[22,1,33,8]]}
[]
[]
[". . . . . . . . . . . . . . . . . . . . . . . . . . . . . . . . . . . . . . . . . . . . . . . . . "]
[]
[null,"Guidelines For Estimating"]
[null,"Swine Farrow-Wean to 6 kg Costs"]
[null,{"$f":"\"Based On \"&'Farrow-Wean Input'!G13&\" Sows \"&FIXED('Farrow-Wean Input'!F30,0)&\" Pigs Sold\"","v":"Based On 600 Sows 16,422 Pigs Sold"}]
[]
[null,null,null,null,null,null,"Date:","April, 2023"]
[]
[]
[null,"This guide is designed to provide you with planning information and a format for calculating costs of production of a swine farrow to 6kg enterprise  in Manitoba.  This operation is intended to represent the first stage of a three stage system.  General Manitoba Agriculture recommendations are assumed in using feed and veterinary inputs. These figures provide an economic evaluation of the livestock and estimated prices required to cover all costs.  Costs include labour, investment and depreciation, but do not include management costs, nor do they necessarily represent the average cost of production in Manitoba."]
[]
[]
[]
[]
[]
[]
[]
[]
{"$rows_left_out":32}
{"sheet":"Assumptions","index":1,"n_rows":17,"n_cols":2,"rows_kept":17,"cut":false,"hidden":false,"merged":[[12,1,14,8],[16,1,22,8],[4,1,5,8],[7,1,10,8],[1,1,1,8]]}
[]
[null,"Farrow-Wean to 6 kg Pig Cost of Production"]
[]
[]
[null,"The following farrow wean to 6 kg cost of production budget is based on the assumption that all feed is purchased or home-mixed."]
[]
[]
[null,{"$f":"\"The budget includes a land investment cost for \"&'Farrow-Wean Input'!G153&\" acres, with \"&'Farrow-Wean Input'!G154&\" acres rented out at $\"&'Farrow-Wean Input'!G155&\" per acre, of the estimated \"&ROUND(((('Weaner-Worksheet'!D136*'Farrow-Wean Input'!F123)/(40.768*2))*2.4709661),0)&\" to \"&ROUND(((('Weaner-Worksheet'!D136*'Farrow-Wean Input'!F123)/(26.362*2))*2.4709661),0)&\" acres of total landbase that would be required for this size of livestock operation. This land base falls within the 2XP2O5 application rate, soil phosphorus levels permitting.\"","v":"The budget includes a land investment cost for 40 acres, with 0 acres rented out at $80 per acre, of the estimated 84 to 130 acres of total landbase that would be required for this size of livestock operation. This land base falls within the 2XP2O5 application rate, soil phosphorus levels permitting."}]
[]
[]
[]
[]
[null,"The rations illustrated in this budget are examples only. Individual farm conditions should be taken into account when formulating the diets. Producers need to know what the feed intakes of their animals are. Please consult with a nutritionist for diet formulation suggestions."]
[]
[]
[]
[null,"The Manitoba pork production industry profile is changing and this budget was specifically designed to address the need of producers who may want to analyze the cost of starting up or switching to a farrow wean 6 kg operation. Several companies are offering contracts with varying levels of guarantees. Producers need to accurately calculate their costs before they can properly make a decision."]

{"sheet":"Farrow-Wean Summary","index":2,"n_rows":68,"n_cols":13,"rows_kept":68,"cut":false,"hidden":false,"merged":[[0,0,0,12],[67,0,68,12],[2,4,2,6],[2,8,2,10],[46,0,46,12]]}
[{"$f":"'Farrow-Wean Input'!G13&\" Sow Farrow-Wean to 6kg Cost of Production Summary - \"&Introduction!H9","v":"600 Sow Farrow-Wean to 6kg Cost of Production Summary - April, 2023"}]
[]
[null,null,null,null,"Purchased Feed",null,null,null,"Home-Mixed Feed"]
[null,null,null,null,"$/Pig",null,"Total",null,"$/Pig",null,"Total"]
["A. Operating Costs",null,null,null,"Sold","$/Sow","Cost",null,"Sold","$/Sow","Cost",null,"Your Cost"]
["1.","Feed Costs:"]
[null,"1.01","Sow Lactation Ration",null,{"$f":"'Weaner-Worksheet'!D16","v":7.52},{"$f":"ROUND(E7*'Farrow-Wean Input'!$G$30,2)","v":205.82},{"$f":"ROUND(E7*'Farrow-Wean Input'!$F$30,0)","v":123493},null,{"$f":"'Weaner-Worksheet'!D54","v":5.83},{"$f":"ROUND(I7*'Farrow-Wean Input'!$G$30,2)","v":159.57},{"$f":"ROUND(I7*'Farrow-Wean Input'!$F$30,0)","v":95740}]
[null,"1.02","Sow Gestation Ration",null,{"$f":"'Weaner-Worksheet'!D26","v":18.989999999999998},{"$f":"ROUND(E8*'Farrow-Wean Input'!$G$30,2)","v":519.76},{"$f":"ROUND(E8*'Farrow-Wean Input'!$F$30,0)","v":311854},null,{"$f":"'Weaner-Worksheet'!D64","v":14.58},{"$f":"ROUND(I8*'Farrow-Wean Input'!$G$30,2)","v":399.05},{"$f":"ROUND(I8*'Farrow-Wean Input'!$F$30,0)","v":239433}]
[null,"1.03","Boar Ration",null,{"$f":"'Weaner-Worksheet'!D36","v":0.11},{"$f":"ROUND(E9*'Farrow-Wean Input'!$G$30,2)","v":3.01},{"$f":"ROUND(E9*'Farrow-Wean Input'!$F$30,0)","v":1806},null,{"$f":"'Weaner-Worksheet'!D74","v":0.08},{"$f":"ROUND(I9*'Farrow-Wean Input'!$G$30,2)","v":2.19},{"$f":"ROUND(I9*'Farrow-Wean Input'!$F$30,0)","v":1314}]
[null,"1.04","Creep Feed",null,{"$f":"'Weaner-Worksheet'!D44","v":1.17},{"$f":"ROUND(E10*'Farrow-Wean Input'!$G$30,2)","v":32.020000000000003},{"$f":"ROUND(E10*'Farrow-Wean Input'!$F$30,0)","v":19214},null,{"$f":"'Weaner-Worksheet'!D82","v":0.64},{"$f":"ROUND(I10*'Farrow-Wean Input'!$G$30,2)","v":17.52},{"$f":"ROUND(I10*'Farrow-Wean Input'!$F$30,0)","v":10510}]
["Total Feed Cost",null,null,null,{"$f":"SUM(E7:E10)","v":27.79},{"$f":"SUM(F7:F10)","v":760.6099999999999},{"$f":"SUM(G7:G10)","v":456367},null,{"$f":"SUM(I7:I10)","v":21.13},{"$f":"SUM(J7:J10)","v":578.33000000000004},{"$f":"SUM(K7:K10)","v":346997}]
[]
["2.","Other Operating Costs:",null,null,null,""]
[null,"2.01","Veterinary Medicine & Supplies:",null,{"$f":"'Weaner-Worksheet'!D90","v":1.21},{"$f":"ROUND(E14*'Farrow-Wean Input'!$G$30,2)","v":33.119999999999997},{"$f":"ROUND(E14*'Farrow-Wean Input'!$F$30,0)","v":19871},null,{"$f":"E14","v":1.21},{"$f":"ROUND(I14*'Farrow-Wean Input'!$G$30,2)","v":33.119999999999997},{"$f":"ROUND(I14*'Farrow-Wean Input'!$F$30,0)","v":19871}]
[null,"2.02","Maintenance & Repairs",null,{"$f":"'Weaner-Worksheet'!D96","v":1.87},{"$f":"ROUND(E15*'Farrow-Wean Input'!$G$30,2)","v":51.18},{"$f":"ROUND(E15*'Farrow-Wean Input'!$F$30,0)","v":30709},null,1.87,{"$f":"ROUND(I15*'Farrow-Wean Input'!$G$30,2)","v":51.18},{"$f":"ROUND(I15*'Farrow-Wean Input'!$F$30,0)","v":30709}]
[null,"2.03","Hydro & Propane",null,{"$f":"'Weaner-Worksheet'!D102","v":3.78485},{"$f":"ROUND(E16*'Farrow-Wean Input'!$G$30,2)","v":103.59},{"$f":"ROUND(E16*'Farrow-Wean Input'!$F$30,0)","v":62155},null,3.78485,{"$f":"ROUND(I16*'Farrow-Wean Input'!$G$30,2)","v":103.59},{"$f":"ROUND(I16*'Farrow-Wean Input'!$F$30,0)","v":62155}]
[null,"2.04","Insurance",null,{"$f":"'Weaner-Worksheet'!D123","v":1.9729388381439532},{"$f":"ROUND(E17*'Farrow-Wean Input'!$G$30,2)","v":54},{"$f":"ROUND(E17*'Farrow-Wean Input'!$F$30,0)","v":32400},null,1.9729388381439532,{"$f":"ROUND(I17*'Farrow-Wean Input'!$G$30,2)","v":54},{"$f":"ROUND(I17*'Farrow-Wean Input'!$F$30,0)","v":32400}]
[null,"2.05","Manure Costs",null,{"$f":"'Weaner-Worksheet'!D166","v":0.93009345706825708},{"$f":"ROUND(E18*'Farrow-Wean Input'!$G$30,2)","v":25.46},{"$f":"ROUND(E18*'Farrow-Wean Input'!$F$30,0)","v":15274},null,0.93009345706825708,{"$f":"ROUND(I18*'Farrow-Wean Input'!$G$30,2)","v":25.46},{"$f":"ROUND(I18*'Farrow-Wean Input'!$F$30,0)","v":15274}]
[null,"2.06","Office Supplies",null,{"$f":"'Weaner-Worksheet'!D171","v":7.3072707343807081E-2},{"$f":"ROUND(E19*'Farrow-Wean Input'!$G$30,2)","v":2},{"$f":"ROUND(E19*'Farrow-Wean Input'!$F$30,0)","v":1200},null,7.3072707343807081E-2,{"$f":"ROUND(I19*'Farrow-Wean Input'!$G$30,2)","v":2},{"$f":"ROUND(I19*'Farrow-Wean Input'!$F$30,0)","v":1200}]
[null,"2.07","Marketing & Transport.",null,{"$f":"'Weaner-Worksheet'!D176","v":3.69},{"$f":"ROUND(E20*'Farrow-Wean Input'!$G$30,2)","v":101},{"$f":"ROUND(E20*'Farrow-Wean Input'!$F$30,0)","v":60597},null,3.69,{"$f":"ROUND(I20*'Farrow-Wean Input'!$G$30,2)","v":101},{"$f":"ROUND(I20*'Farrow-Wean Input'!$F$30,0)","v":60597}]
{"$rows_left_out":49}
{"sheet":"Risk Analysis","index":3,"n_rows":55,"n_cols":5,"rows_kept":55,"cut":false,"hidden":false,"merged":[[0,0,0,7],[54,0,56,7]]}
["Risk & Sensitivity Analysis"]
[]
[null,null,"Purchased Feed",null,"Home-Mixed Feed"]
[null,null,"Per Pig",null,"Per Pig"]
["A.  Operating Costs"]
[null,"Feed cost",{"$f":"'Farrow-Wean Summary'!E11","v":27.79},null,{"$f":"'Farrow-Wean Summary'!I11","v":21.13}]
[null,"Other Operating Costs",{"$f":"SUM('Farrow-Wean Summary'!E26-'Farrow-Wean Summary'!E11)","v":20.482881929848674},null,{"$f":"SUM('Farrow-Wean Summary'!I26-'Farrow-Wean Summary'!I11)","v":20.363981929848681}]
[null,"Subtotal",{"$f":"SUM(C6:C7)","v":48.272881929848673},null,{"$f":"SUM(E6:E7)","v":41.49398192984868}]
["B.  Fixed Costs",null,{"$f":"'Farrow-Wean Summary'!E40","v":9.6197890999878215},null,{"$f":"'Farrow-Wean Summary'!I40","v":10.136489099987822}]
["C.  Labour",null,{"$f":"'Farrow-Wean Summary'!E43","v":10.26},null,{"$f":"'Farrow-Wean Summary'!I43","v":10.26}]
["Total Costs",null,{"$f":"SUM(C8:C10)","v":68.152671029836497},null,{"$f":"SUM(E8:E10)","v":61.890471029836498}]
[]
["Estimated Farmgate"]
[null,"Price ($ per weanling)",{"$f":"'Farrow-Wean Summary'!E50","v":56},null,{"$f":"'Farrow-Wean Summary'!I50","v":56}]
[null,"Weanlings sold per sow",{"$f":"'Farrow-Wean Input'!G30","v":27.37},null,{"$f":"'Farrow-Wean Input'!G30","v":27.37}]
[]
[]
[null,null,"Up",null,"Down"]
[null,"Percent Market Price Variation",0.1,null,0.1]
[null,"Percent Feed Cost Variation",0.1,null,0.05]
{"$rows_left_out":36}
{"sheet":"Farrow-Wean Input","index":4,"n_rows":163,"n_cols":11,"rows_kept":163,"cut":false,"hidden":false,"merged":[[80,0,80,10],[1,0,1,10],[78,0,78,10],[79,0,79,10]]}
[]
["Farrow to 6kg Pig Production Costs"]
[]
["1."," This input table outlines the production assumptions used."]
["2."," Buildings and equipment are valued at new cost."]
["3."," Manure haulage is contracted out."]
["4."," Gilts are purchased for herd replacement."]
[]
[null,null,"Weanling market price / head",null,null,56]
[]
["Indicators of Productivity"]
[]
["Sows",null,null,null,null,null,600]
["Boars",null,null,null,null,null,3]
["Litters/Sow/Year",null,null,null,null,null,2.375]
["Average Weaning Age (days)",null,null,null,null,null,21]
["Average Born Alive per Litter",null,null,null,null,null,13.5]
["Percent Pre-Weaning Mortality",null,null,null,null,null,12.5]
["Percent Post-Weaning Culls",null,null,null,null,null,2.44]
[]
{"$rows_left_out":144}
{"sheet":"Feed-Cost","index":5,"n_rows":77,"n_cols":8,"rows_kept":77,"cut":false,"hidden":false,"merged":[[1,0,1,7]]}
[]
["Feed Ingredient Costs"]
[]
[null,"Ingredients",null,null,"Price/tonne",null,"Your Cost"]
[null,"  Wheat",null,null,370]
[null,"  Barley",null,null,320]
[null,"  Corn ",null,null,355]
[null,"  Soybean Meal ",null,null,665]
[null,"  Canola Meal ",null,null,425]
[null,"  Peas",null,null,390]
[null,"  Sow Micro",null,null,6000]
[null,"  Canola Oil",null,null,2400]
[null,"  Whey Powder ",null,null,1364.6]
[null,"  Fish Meal",null,null,3364.4]
[null,"  Plasma",null,null,5720]
[null,"  Limestone",null,null,203.95]
[null,"  Dical (16% Ca-21% P) ",null,null,1544.23]
[null,"  Salt - 96%",null,null,261.89999999999998]
[null,"  Phytase",null,null,14500]
[null,"  L-Lysine HCL",null,null,2248.5]
{"$rows_left_out":58}
{"sheet":"Feed-Summary","index":6,"n_rows":79,"n_cols":10,"rows_kept":79,"cut":false,"hidden":false,"merged":[[1,0,1,9]]}
[]
["Feed Requirement and Cost Summary"]
[]
[null,null,null,null,null,"Ingredient",null,"Ration"]
[null,null,null,"Amount",null,"    Price",null,"Cost"]
["Sow Gestation & Boar Ration:",null,null,"       (kg)",null,"($ /tonne)",null,"($ /tonne)",null,"Your Cost"]
[{"$f":"'Feed-Cost'!B5","v":"  Wheat"},null,null,{"$f":"IF('Feed-Cost'!D32=0,\" \",'Feed-Cost'!D32)","v":259},null,{"$f":"IF('Feed-Cost'!D32=0,\" \",'Feed-Cost'!E5)","v":370},null,{"$f":"IF('Feed-Cost'!D32=0,\" \",ROUND((D7/1000)*F7,2))","v":95.83}]
[{"$f":"'Feed-Cost'!B6","v":"  Barley"},null,null,{"$f":"IF('Feed-Cost'!D33=0,\" \",'Feed-Cost'!D33)","v":539},null,{"$f":"IF('Feed-Cost'!D33=0,\" \",'Feed-Cost'!E6)","v":320},null,{"$f":"IF('Feed-Cost'!D33=0,\" \",ROUND((D8/1000)*F8,2))","v":172.48}]
[{"$f":"'Feed-Cost'!B7","v":"  Corn "},null,null,{"$f":"IF('Feed-Cost'!D34=0,\" \",'Feed-Cost'!D34)","v":" "},null,{"$f":"IF('Feed-Cost'!D34=0,\" \",'Feed-Cost'!E7)","v":" "},null,{"$f":"IF('Feed-Cost'!D34=0,\" \",ROUND((D9/1000)*F9,2))","v":" "}]
[{"$f":"'Feed-Cost'!B8","v":"  Soybean Meal "},null,null,{"$f":"IF('Feed-Cost'!D35=0,\" \",'Feed-Cost'!D35)","v":" "},null,{"$f":"IF('Feed-Cost'!D35=0,\" \",'Feed-Cost'!E8)","v":" "},null,{"$f":"IF('Feed-Cost'!D35=0,\" \",ROUND((D10/1000)*F10,2))","v":" "}]
[{"$f":"'Feed-Cost'!B9","v":"  Canola Meal "},null,null,{"$f":"IF('Feed-Cost'!D36=0,\" \",'Feed-Cost'!D36)","v":80},null,{"$f":"IF('Feed-Cost'!D36=0,\" \",'Feed-Cost'!E9)","v":425},null,{"$f":"IF('Feed-Cost'!D36=0,\" \",ROUND((D11/1000)*F11,2))","v":34}]
[{"$f":"'Feed-Cost'!B10","v":"  Peas"},null,null,{"$f":"IF('Feed-Cost'!D37=0,\" \",'Feed-Cost'!D37)","v":91},null,{"$f":"IF('Feed-Cost'!D37=0,\" \",'Feed-Cost'!E10)","v":390},null,{"$f":"IF('Feed-Cost'!D37=0,\" \",ROUND((D12/1000)*F12,2))","v":35.49}]
[{"$f":"'Feed-Cost'!B11","v":"  Sow Micro"},null,null,{"$f":"IF('Feed-Cost'!D38=0,\" \",'Feed-Cost'!D38)","v":5},null,{"$f":"IF('Feed-Cost'!D38=0,\" \",'Feed-Cost'!E11)","v":6000},null,{"$f":"IF('Feed-Cost'!D38=0,\" \",ROUND((D13/1000)*F13,2))","v":30}]
[{"$f":"'Feed-Cost'!B12","v":"  Canola Oil"},null,null,{"$f":"IF('Feed-Cost'!D39=0,\" \",'Feed-Cost'!D39)","v":" "},null,{"$f":"IF('Feed-Cost'!D39=0,\" \",'Feed-Cost'!E12)","v":" "},null,{"$f":"IF('Feed-Cost'!D39=0,\" \",ROUND((D14/1000)*F14,2))","v":" "}]
[{"$f":"'Feed-Cost'!B13","v":"  Whey Powder "},null,null,{"$f":"IF('Feed-Cost'!D40=0,\" \",'Feed-Cost'!D40)","v":" "},null,{"$f":"IF('Feed-Cost'!D40=0,\" \",'Feed-Cost'!E13)","v":" "},null,{"$f":"IF('Feed-Cost'!D40=0,\" \",ROUND((D15/1000)*F15,2))","v":" "}]
[{"$f":"'Feed-Cost'!B14","v":"  Fish Meal"},null,null,{"$f":"IF('Feed-Cost'!D41=0,\" \",'Feed-Cost'!D41)","v":" "},null,{"$f":"IF('Feed-Cost'!D41=0,\" \",'Feed-Cost'!E14)","v":" "},null,{"$f":"IF('Feed-Cost'!D41=0,\" \",ROUND((D16/1000)*F16,2))","v":" "}]
[{"$f":"'Feed-Cost'!B15","v":"  Plasma"},null,null,{"$f":"IF('Feed-Cost'!D42=0,\" \",'Feed-Cost'!D42)","v":" "},null,{"$f":"IF('Feed-Cost'!D42=0,\" \",'Feed-Cost'!E15)","v":" "},null,{"$f":"IF('Feed-Cost'!D42=0,\" \",ROUND((D17/1000)*F17,2))","v":" "}]
[{"$f":"'Feed-Cost'!B16","v":"  Limestone"},null,null,{"$f":"IF('Feed-Cost'!D43=0,\" \",'Feed-Cost'!D43)","v":10},null,{"$f":"IF('Feed-Cost'!D43=0,\" \",'Feed-Cost'!E16)","v":203.95},null,{"$f":"IF('Feed-Cost'!D43=0,\" \",ROUND((D18/1000)*F18,2))","v":2.04}]
[{"$f":"'Feed-Cost'!B17","v":"  Dical (16% Ca-21% P) "},null,null,{"$f":"IF('Feed-Cost'!D44=0,\" \",'Feed-Cost'!D44)","v":11},null,{"$f":"IF('Feed-Cost'!D44=0,\" \",'Feed-Cost'!E17)","v":1544.23},null,{"$f":"IF('Feed-Cost'!D44=0,\" \",ROUND((D19/1000)*F19,2))","v":16.989999999999998}]
[{"$f":"'Feed-Cost'!B18","v":"  Salt - 96%"},null,null,{"$f":"IF('Feed-Cost'!D45=0,\" \",'Feed-Cost'!D45)","v":3.5},null,{"$f":"IF('Feed-Cost'!D45=0,\" \",'Feed-Cost'!E18)","v":261.89999999999998},null,{"$f":"IF('Feed-Cost'!D45=0,\" \",ROUND((D20/1000)*F20,2))","v":0.92}]
{"$rows_left_out":60}
{"sheet":"Weaner-Worksheet","index":7,"n_rows":358,"n_cols":10,"rows_kept":358,"cut":false,"hidden":false,"merged":[[1,0,1,9],[357,3,359,9],[353,3,354,7],[355,3,355,5],[254,3,254,5],[255,3,255,5],[289,1,289,3],[289,5,289,6],[228,1,228,5],[353,1,354,2]]}
[]
["Production Cost Worksheet"]
[]
["A. Operating Costs",null,null,null,null,null,null,null,null,"Your Cost"]
[]
["1. Feed Requirements and Costs"]
[]
[null,"1.01  Sow Lactation Ration - Purchased Feeds"]
[null,null,"",{"$f":"'Farrow-Wean Input'!G16","v":21},null,"days average weaning age"]
[null,null,"x",{"$f":"'Farrow-Wean Input'!G15","v":2.375},null,"litters/sow/year"]
[null,null,"=",{"$f":"D9*D10","v":49.875},null,"days lactation"]
[null,null,"x",{"$f":"'Farrow-Wean Input'!F35","v":6.5},null,"kg ration/day"]
[null,null,"x",{"$f":"'Farrow-Wean Input'!H35","v":635},null,"/tonne ration"]
[null,null,"÷",1000,null,"kg/tonne"]
[null,null,"÷",{"$f":"'Farrow-Wean Input'!$G$30","v":27.37},null,"pigs/sow"]
[null,null,"=",{"$f":"ROUND((D9*D10*D12*D13/1000)/D15,2)","v":7.52},null,"/pig sold"]
[null,null,""]
[null,"1.02  Sow Gestation Ration - Purchased Feeds"]
[null,null,"",365,null,"days/year"]
[null,null,"-",{"$f":"D11","v":49.875},null,"days lactation"]
{"$rows_left_out":339}
{"sheet":"Ingredient-Summary","index":8,"n_rows":40,"n_cols":7,"rows_kept":40,"cut":false,"hidden":false,"merged":[[1,2,1,6],[16,0,16,7]]}
[]
[null,null,"  Summary of Purchased Feeds Used"]
[]
[null,"Number of Sows",null,{"$f":"'Farrow-Wean Input'!$G$13","v":600}]
[null,"Total Pigs Fed",null,{"$f":"'Farrow-Wean Input'!$F$28","v":16833}]
[]
[null,null,null,"Total","Total","Total","Total"]
[null,null,null,"per Year","per Month","per Pig","per Pig"]
[null,null,null,"(tonnes)","(tonnes)","(kgs)","(lbs)"]
[null,"Dry Sow",null,{"$f":"IF('Farrow-Wean Input'!H34<=0,0,('Farrow-Wean Input'!F34*'Weaner-Worksheet'!D21)*'Farrow-Wean Input'!F23/1000)","v":567.22500000000002},{"$f":"D10/12","v":47.268750000000004},{"$f":"(D10/$D$5)*1000","v":33.697201924790598},{"$f":"F10*2.2046","v":74.288851363393348}]
[null,"Lactating Sow",null,{"$f":"IF('Farrow-Wean Input'!H35<=0,0,('Farrow-Wean Input'!F35*'Weaner-Worksheet'!D11)*'Farrow-Wean Input'!F23/1000)","v":194.51249999999999},{"$f":"D11/12","v":16.209374999999998},{"$f":"(D11/$D$5)*1000","v":11.555426840135448},{"$f":"F11*2.2046","v":25.475094011762611}]
[null,"Boar",null,{"$f":"IF('Farrow-Wean Input'!H36<=0,0,('Farrow-Wean Input'!F36*'Weaner-Worksheet'!D29)*'Farrow-Wean Input'!F24/1000)","v":3.2850000000000001},{"$f":"D12/12","v":0.27374999999999999},{"$f":"(D12/$D$5)*1000","v":0.19515237925503476},{"$f":"F12*2.2046","v":0.43023293530564966}]
[null,"Creep",null,{"$f":"IF('Farrow-Wean Input'!H37<=0,0,('Farrow-Wean Input'!F37*'Farrow-Wean Input'!F28)/1000)","v":8.4164999999999992},{"$f":"D13/12","v":0.70137499999999997},{"$f":"(D13/$D$5)*1000","v":0.49999999999999989},{"$f":"F13*2.2046","v":1.1022999999999998}]
[null,"Total",null,{"$f":"SUM(D10:D13)","v":773.43899999999996},{"$f":"SUM(E10:E13)","v":64.453250000000011},{"$f":"SUM(F10:F13)","v":45.947781144181079},{"$f":"SUM(G10:G13)","v":101.29647831046161}]
[]
[]
["  Summary of Home Feed Ingredients Used"]
[null,null,null,"Total","Total","Total","Total"]
[null," ",null,"per Year","per Month","per Pig","per Pig"]
[null,null,null,"(tonnes)","(tonnes)","(kgs)","(lbs)"]
{"$rows_left_out":20}