{"text_format":"1","workbook":"xlsx","n_sheets":10,"sheets":["Introduction","Summary","Risk Analysis","Charts","Seed, Fertilizer & Chemical","Op. Cost Input","Fixed Cost Input","Assumptions","Chart data (HIDE)","Data (HIDE)"],"not_rendered":{"charts":3,"images":4,"macros":1,"external_links":0,"defined_names":113,"comments":2,"pivot_tables":0},"unopened":[],"bounds":{"document_bytes":16777216,"sheet_cells":100000,"rows_first":2000,"rows_last":500,"rows_between":2000,"halvings":0,"cell_chars":16384,"cell_head_chars":4096},"cells_cut":0,"cells_raw":0,"read":"whole","date_system":"1900"}

{"sheet":"Introduction","index":0,"n_rows":54,"n_cols":9,"rows_kept":54,"cut":false,"hidden":false,"merged":[[5,0,5,8],[4,0,4,8],[56,1,56,8],[6,0,6,8],[16,1,22,8],[24,1,26,8],[53,1,55,8],[41,1,44,8]]}
[]
[]
[". . . . . . . . . . . . . . . . . . . . . . . . . . . . . . . . . . . . . . . . . . . . . . . . . "]
[]
["Guidelines For Estimating"]
[{"$f":"\"Special Crop Production Costs - \"&I11","v":"Special Crop Production Costs - 2023"}]
[]
[]
[]
[]
[null,null,null,null,null,null,null,"Date:  January,",2023]
[]
[]
[]
[]
{"$rows_left_out":40}
{"sheet":"Summary","index":1,"n_rows":69,"n_cols":23,"rows_kept":69,"cut":false,"hidden":false,"merged":[[68,1,69,8],[68,9,69,10],[0,0,0,8],[0,9,0,10],[32,2,32,8],[52,2,52,8]]}
[{"$f":"IF('Data (HIDE)'!B13=\"Manitoba\",\"Special Crop Production Costs \"&Introduction!I11&\" Guidelines (Dollars Per Acre)\",\"Special Crop Production Costs \"&Introduction!I11&\" Guidelines \"&'Data (HIDE)'!B13&\" (Dollars Per Acre)\")","v":"Special Crop Production Costs 2023 Guidelines (Dollars Per Acre)"}]
[null,null,{"$f":"'Data (HIDE)'!$B$16","v":"Black Bean"},{"$f":"'Data (HIDE)'!$B$17","v":"Kidney Bean"},{"$f":"'Data (HIDE)'!$B$18","v":"Hempseed"},{"$f":"'Data (HIDE)'!$B$19","v":"Fababean"},{"$f":"'Data (HIDE)'!$B$20","v":"Buckwheat"},{"$f":"'Data (HIDE)'!$B$21","v":"Canaryseed"},{"$f":"'Data (HIDE)'!$B$22","v":"Lentil"},null,"Your Farm"]
["A.  Operating Costs"]
[null,"Seed & Treatment",{"$f":"'Data (HIDE)'!$L$16","v":115},{"$f":"'Data (HIDE)'!$L$17","v":166.5},{"$f":"'Data (HIDE)'!$L$18","v":58.75},{"$f":"'Data (HIDE)'!$L$19","v":54},{"$f":"'Data (HIDE)'!$L$20","v":25},{"$f":"'Data (HIDE)'!$L$21","v":33},{"$f":"'Data (HIDE)'!$L$22","v":70}]
[null,"Fertilizer",{"$f":"'Data (HIDE)'!$M$16","v":113.23783861014172},{"$f":"'Data (HIDE)'!$M$17","v":113.23783861014172},{"$f":"'Data (HIDE)'!$M$18","v":113.23783861014172},{"$f":"'Data (HIDE)'!$M$19","v":54.809640448758657},{"$f":"'Data (HIDE)'!$M$20","v":61.141615388692912},{"$f":"'Data (HIDE)'!$M$21","v":97.952434762968494},{"$f":"'Data (HIDE)'!$M$22","v":28.349814025219992}]
[null,"Crop Protection",{"$f":"'Data (HIDE)'!$N$16+'Data (HIDE)'!$O$16+'Data (HIDE)'!$P$16","v":124.52},{"$f":"'Data (HIDE)'!$N$17++'Data (HIDE)'!$O$17+'Data (HIDE)'!$P$17","v":124.52},{"$f":"'Data (HIDE)'!$N$18+'Data (HIDE)'!$O$18+'Data (HIDE)'!$P$18","v":52.13},{"$f":"'Data (HIDE)'!$N$19+'Data (HIDE)'!$O$19+'Data (HIDE)'!$P$19","v":15.5},{"$f":"'Data (HIDE)'!$N$20+'Data (HIDE)'!$O$20+'Data (HIDE)'!$P$20","v":6.5},{"$f":"'Data (HIDE)'!$N$21+'Data (HIDE)'!$O$21+'Data (HIDE)'!$P$21","v":30.67},{"$f":"'Data (HIDE)'!$N$22+'Data (HIDE)'!$O$22+'Data (HIDE)'!$P$22","v":30.35}]
[null,"if delete it will affect crop rotation and fuel calcs"]
[null,"if delete it will affect crop rotation and fuel calcs"]
[null,"Fuel",{"$f":"'Data (HIDE)'!$Q$16","v":37.893705473684214},{"$f":"'Data (HIDE)'!$Q$17","v":37.222572315789478},{"$f":"'Data (HIDE)'!$Q$18","v":38.715544736842105},{"$f":"'Data (HIDE)'!$Q$19","v":35.049425052631577},{"$f":"'Data (HIDE)'!$Q$20","v":33.597151326315789},{"$f":"'Data (HIDE)'!$Q$21","v":36.838230694736843},{"$f":"'Data (HIDE)'!$Q$22","v":31.895099210526315}]
[null,"Machinery Operating & Lease",{"$f":"'Data (HIDE)'!$R$16+'Data (HIDE)'!$S$16+'Data (HIDE)'!$T$16","v":25},{"$f":"'Data (HIDE)'!$R$17+'Data (HIDE)'!$S$17+'Data (HIDE)'!$T$17","v":25},{"$f":"'Data (HIDE)'!$R$18+'Data (HIDE)'!$S$18+'Data (HIDE)'!$T$18","v":25},{"$f":"'Data (HIDE)'!$R$19+'Data (HIDE)'!$S$19+'Data (HIDE)'!$T$19","v":25},{"$f":"'Data (HIDE)'!$R$20+'Data (HIDE)'!$S$20+'Data (HIDE)'!$T$20","v":25},{"$f":"'Data (HIDE)'!$R$21+'Data (HIDE)'!$S$21+'Data (HIDE)'!$T$21","v":25},{"$f":"'Data (HIDE)'!$R$22+'Data (HIDE)'!$S$22+'Data (HIDE)'!$T$22","v":25}]
[null,"if delete it will affect crop rotation and fuel calcs"]
[null,"if delete it will affect crop rotation and fuel calcs"]
[null,"Labour - Hired",{"$f":"'Data (HIDE)'!$U$16","v":5.2},{"$f":"'Data (HIDE)'!$U$17","v":5.2},{"$f":"'Data (HIDE)'!$U$18","v":5.2},{"$f":"'Data (HIDE)'!$U$19","v":5.2},{"$f":"'Data (HIDE)'!$U$20","v":5.2},{"$f":"'Data (HIDE)'!$U$21","v":5.2},{"$f":"'Data (HIDE)'!$U$22","v":5.2}]
[null,"Crop Insurance",{"$f":"'Data (HIDE)'!$V$16","v":40.5},{"$f":"'Data (HIDE)'!$V$17","v":57},{"$f":"'Data (HIDE)'!$V$18","v":36.75},{"$f":"'Data (HIDE)'!$V$19","v":36.75},{"$f":"'Data (HIDE)'!$V$20","v":19.75},{"$f":"'Data (HIDE)'!$V$21","v":30.75},{"$f":"'Data (HIDE)'!$V$22","v":20.5}]
[null,"Hail Insurance",{"$f":"'Data (HIDE)'!$W$16","v":21.875},{"$f":"'Data (HIDE)'!$W$17","v":21.875},{"$f":"'Data (HIDE)'!$W$18","v":25},{"$f":"'Data (HIDE)'!$W$19","v":21.875},{"$f":"'Data (HIDE)'!$W$20","v":31.25},{"$f":"'Data (HIDE)'!$W$21","v":12.5},{"$f":"'Data (HIDE)'!$W$22","v":16.25}]
{"$rows_left_out":55}
{"sheet":"Risk Analysis","index":2,"n_rows":64,"n_cols":11,"rows_kept":64,"cut":false,"hidden":false,"merged":[[20,0,20,8],[20,9,20,10],[63,1,64,8],[0,0,0,8],[51,0,51,8]]}
[{"$f":"IF('Data (HIDE)'!B13=\"Manitoba\",\"AgriInsurance Analysis\",\"AgriInsurance Analysis - \"&'Data (HIDE)'!B13)","v":"AgriInsurance Analysis"}]
[]
[null,{"$f":"\"*Based on \"&'Data (HIDE)'!B45&\"*\"","v":"*Based on 2022 MASC data*"},{"$f":"'Data (HIDE)'!$B$16","v":"Black Bean"},{"$f":"'Data (HIDE)'!$B$17","v":"Kidney Bean"},{"$f":"'Data (HIDE)'!$B$18","v":"Hempseed"},{"$f":"'Data (HIDE)'!$B$19","v":"Fababean"},{"$f":"'Data (HIDE)'!$B$20","v":"Buckwheat"},{"$f":"'Data (HIDE)'!$B$21","v":"Canaryseed"},{"$f":"'Data (HIDE)'!$B$22","v":"Lentil"},null,"Your Farm"]
[]
["AgriInsurance "]
[null,{"$f":"'Data (HIDE)'!B14","v":"80% Insured Value"},{"$f":"'Data (HIDE)'!$AJ$16","v":564.67600000000004},{"$f":"'Data (HIDE)'!$AJ$17","v":655.04399999999998},{"$f":"'Data (HIDE)'!$AJ$18","v":396.24},{"$f":"'Data (HIDE)'!$AJ$19","v":237.44000000000003},{"$f":"'Data (HIDE)'!$AJ$20","v":151.63200000000001},{"$f":"'Data (HIDE)'!$AJ$21","v":434.88000000000005},{"$f":"'Data (HIDE)'!$AJ$22","v":250.56000000000006}]
[null,"Premium Cost (% of Insured)",{"$f":"'Data (HIDE)'!$AK$16","v":7.1722545318023079E-2},{"$f":"'Data (HIDE)'!$AK$17","v":8.7017055342847205E-2},{"$f":"'Data (HIDE)'!$AK$18","v":9.2746820109024825E-2},{"$f":"'Data (HIDE)'!$AK$19","v":0.15477594339622638},{"$f":"'Data (HIDE)'!$AK$20","v":0.13024955154584783},{"$f":"'Data (HIDE)'!$AK$21","v":7.0709161147902863E-2},{"$f":"'Data (HIDE)'!$AK$22","v":8.1816730523627063E-2}]
[]
["Costs Not Covered By AgriInsurance"]
[null,"Operating Costs",{"$f":"IF(Summary!C21-C6<0,0,SUM(Summary!C21-C6))","v":0},{"$f":"IF(Summary!D21-D6<0,0,SUM(Summary!D21-D6))","v":0},{"$f":"IF(Summary!E21-E6<0,0,SUM(Summary!E21-E6))","v":13.512373152569637},{"$f":"IF(Summary!F21-F6<0,0,SUM(Summary!F21-F6))","v":67.324371464174334},{"$f":"IF(Summary!G21-G6<0,0,SUM(Summary!G21-G6))","v":104.78411181251857},{"$f":"IF(Summary!H21-H6<0,0,SUM(Summary!H21-H6))","v":0},{"$f":"IF(Summary!I21-I6<0,0,SUM(Summary!I21-I6))","v":27.476802021890649}]
[null,"Operating & Fixed Costs",{"$f":"IF(Summary!C27-C6<0,0,SUM(Summary!C27-C6))","v":0},{"$f":"IF(Summary!D27-D6<0,0,SUM(Summary!D27-D6))","v":0},{"$f":"IF(Summary!E27-E6<0,0,SUM(Summary!E27-E6))","v":0},{"$f":"IF(Summary!F27-F6<0,0,SUM(Summary!F27-F6))","v":0},{"$f":"IF(Summary!G27-G6<0,0,SUM(Summary!G27-G6))","v":0},{"$f":"IF(Summary!H27-H6<0,0,SUM(Summary!H27-H6))","v":0},{"$f":"IF(Summary!I27-I6<0,0,SUM(Summary!I27-I6))","v":0}]
[null,"Total Costs",{"$f":"IF(Summary!C31-C6<0,0,SUM(Summary!C31-C6))","v":201.4464694892423},{"$f":"IF(Summary!D31-D6<0,0,SUM(Summary!D31-D6))","v":179.88469437887102},{"$f":"IF(Summary!E31-E6<0,0,SUM(Summary!E31-E6))","v":223.05229596062509},{"$f":"IF(Summary!F31-F6<0,0,SUM(Summary!F31-F6))","v":276.8642942722297},{"$f":"IF(Summary!G31-G6<0,0,SUM(Summary!G31-G6))","v":314.32403462057397},{"$f":"IF(Summary!H31-H6<0,0,SUM(Summary!H31-H6))","v":102.08544439218605},{"$f":"IF(Summary!I31-I6<0,0,SUM(Summary!I31-I6))","v":237.01672482994604}]
[]
["AgriInsurance Risk Ratio",null,"(AgriInsurance Coverage / Cost)"]
[null,"Operating Costs",{"$f":"SUM(C6/Summary!C21)","v":1.0337914045808108},{"$f":"SUM(D6/Summary!D21)","v":1.0650693598501981},{"$f":"SUM(E6/Summary!E21)","v":0.96702307530617193},{"$f":"SUM(F6/Summary!F21)","v":0.77909369411939788},{"$f":"SUM(G6/Summary!G21)","v":0.59135129586110946},{"$f":"SUM(H6/Summary!H21)","v":1.3281799106434633},{"$f":"SUM(I6/Summary!I21)","v":0.90117566515627201}]
{"$rows_left_out":50}
{"sheet":"Charts","index":3,"n_rows":0,"n_cols":0,"rows_kept":0,"cut":false,"hidden":false,"merged":[]}

{"sheet":"Seed, Fertilizer & Chemical","index":4,"n_rows":56,"n_cols":46,"rows_kept":56,"cut":false,"hidden":false,"merged":[[36,1,38,14],[40,0,40,14],[0,0,0,14],[11,0,11,14],[22,2,22,12],[23,2,23,3],[23,5,23,6],[23,8,23,9],[23,11,23,12],[33,1,34,14]]}
["Seed & Treatment"]
[null,null,null,"Seeding Rate",null,null,"Price",null,null,"Cost"]
["Crop",null,null,"per Acre",null,null,"per Unit",null,null,"per Acre"]
[null,"Hempseed",null,25,"lb",null,2.35,"/lb",null,{"$f":"ROUND(D4*G4,2)","v":58.75}]
[null,"Black Bean",null,1.25,"unit",null,92,"/unit",null,115]
[null,"Kidney Bean",null,0.75,"unit",null,222,"/unit",null,166.5]
[null,"Buckwheat",null,1,"bu",null,25,"/bu",null,25]
[null,"Canaryseed",null,44,"lb",null,0.75,"/lb",null,33]
[null,"Fababean",null,180,"lb",null,0.3,"/lb",null,54]
[null,"Lentil",null,2,"bu",null,35,"/bu",null,70]
[]
["Fertilizer"]
[null,null,null,"Bulk Price",null,null,"Actual Nutrient",null,null,"Nitrogen",null,null,"Sulphur"]
["Fertilizer Type",null,null,"$/tonne",null,null,"$/lb",null,null,"Usage",null,null,"Usage"]
[null,"Nitrogen: (urea) 46-0-0",null,1100,null,null,{"$f":"SUM(D15/(2204.5855*0.46))","v":1.0846956708306785},null,null,0.75,null,null," -"]
{"$rows_left_out":42}
{"sheet":"Op. Cost Input","index":5,"n_rows":34,"n_cols":29,"rows_kept":34,"cut":false,"hidden":false,"merged":[[0,0,0,13],[24,4,25,4],[24,5,25,5],[24,6,25,6],[24,7,25,7],[24,8,25,8],[24,9,25,9],[21,0,21,13],[10,8,10,13],[9,4,9,13],[24,10,25,10],[24,11,25,11],[24,12,25,12],[24,13,25,13],[23,12,23,13],[23,4,23,11]]}
["Operating Costs"]
[]
[null,"Interest Rate on Operating",null,7.7499999999999999E-2,null,null,"Grain Hauling",null,null,null,null,null,null,null,null,null,null,"# Hired","# of","Acres","Hours "]
[null,"Land Taxes  ($/acre)",null,17.5,null,null,"  Distance to storage",null,6,"miles roundtrip",null,null,null,null,null,null,null,"Staff","Months","Farmed","Per Acre"]
[null,"Labour rate ($/hour)",null,26,null,null,"  Distance to market",null,45,"miles roundtrip",null,null,null,null,null,null,null,1,12,{"$f":"'Fixed Cost Input'!D5+'Fixed Cost Input'!D6","v":2500},{"$f":"SUM(R5*S5*4*40)/T5","v":0.76800000000000002}]
[null,"Machinery Operating  ($/acre)",null,25,null,null,"  Grain truck fuel use",null,5,"Miles per Imp. Gallon",null,null,null,null,null,null,null,1,4,{"$f":"T5","v":2500},{"$f":"SUM(R6*S6*4*40)/T6","v":0.25600000000000001}]
[null,"Other Costs ($/acre)",null,17.75,null,null,"  Grain truck size",null,475,"bushels",null,null,null,null,null,null,null,0,0,{"$f":"T5","v":2500},{"$f":"SUM(R7*S7*4*40)/T7","v":0}]
[null,"Fuel Cost  ($/litre)",null,1.65,null,null,null,null,null,null,null,null,null,null,null,null,null,0,0,{"$f":"T5","v":2500},{"$f":"SUM(R8*S8*4*40)/T8","v":0}]
[null,"Owners - Labour & Living (hrs/acre)",null,1,null,null,null,null,null,null,null,null,null,null,null,null,null,null,null,"Total",{"$f":"SUM(U5:U8)","v":1.024}]
[null,null,null,null,"Operating Cost ($/Acre)"]
[null,null,"Labour",null,"Crop*","Hail","Drying","Storage","Rental and Custom Costs"]
["Crop",null,"(hrs/acre)","Fuel","Insurance","Insurance","Costs","$/acre**","Seeding","Application","Swathing","Harvest","General","Total"]
[null,{"$f":"'Seed, Fertilizer & Chemical'!B4","v":"Hempseed"},0.2,{"$f":"SUM($D$8*D28)","v":38.715544736842105},{"$f":"MROUND(HLOOKUP('Data (HIDE)'!$V$14,'Data (HIDE)'!$C$68:$G$75,2,FALSE)+'Data (HIDE)'!$D$77,0.25)","v":36.75},{"$f":"HLOOKUP('Data (HIDE)'!$W$14,'Data (HIDE)'!$D$82:$H$90,3,FALSE)","v":25},"-",{"$f":"-PMT('Fixed Cost Input'!$C$11,20,(HLOOKUP('Data (HIDE)'!$B$13,'Data (HIDE)'!$C$46:$G$53,2,FALSE)/44*(('Fixed Cost Input'!$C$17*'Fixed Cost Input'!$D$17)+('Fixed Cost Input'!$C$18*'Fixed Cost Input'!$D$18)+('Fixed Cost Input'!$C$19*'Fixed Cost Input'!$D$19))*'Fixed Cost Input'!$D$20),0)","v":4.4289898055858083},"-","-","-","-","-",{"$f":"SUM(I13:M13)","v":0},null,null,null,null,null,null,null,null,null,null,null,null,null,{"$f":"MROUND(HLOOKUP('Data (HIDE)'!$V$14,'Data (HIDE)'!$C$68:$G$75,2,FALSE)+'Data (HIDE)'!$D$77,0.25)","v":36.75},{"$f":"HLOOKUP('Data (HIDE)'!$W$14,'Data (HIDE)'!$D$82:$H$90,3,FALSE)","v":25}]
[null,{"$f":"'Seed, Fertilizer & Chemical'!B5","v":"Black Bean"},0.2,37.893705473684214,{"$f":"MROUND(HLOOKUP('Data (HIDE)'!$V$14,'Data (HIDE)'!$C$68:$G$75,3,FALSE)+'Data (HIDE)'!$D$77,0.25)","v":40.5},{"$f":"HLOOKUP('Data (HIDE)'!$W$14,'Data (HIDE)'!$D$82:$H$90,4,FALSE)","v":21.875},"-",{"$f":"-PMT('Fixed Cost Input'!$C$11,20,(HLOOKUP('Data (HIDE)'!$B$13,'Data (HIDE)'!$C$46:$G$53,3,FALSE)/60*(('Fixed Cost Input'!$C$17*'Fixed Cost Input'!$D$17)+('Fixed Cost Input'!$C$18*'Fixed Cost Input'!$D$18)+('Fixed Cost Input'!$C$19*'Fixed Cost Input'!$D$19))*'Fixed Cost Input'!$D$20),0)","v":7.3619652768404089},"-","-","-","-","-",{"$f":"SUM(I14:M14)","v":0},null,null,null,null,null,null,null,null,null,null,null,null,null,{"$f":"MROUND(HLOOKUP('Data (HIDE)'!$V$14,'Data (HIDE)'!$C$68:$G$75,3,FALSE)+'Data (HIDE)'!$D$77,0.25)","v":40.5},{"$f":"HLOOKUP('Data (HIDE)'!$W$14,'Data (HIDE)'!$D$82:$H$90,4,FALSE)","v":21.875}]
[null,{"$f":"'Seed, Fertilizer & Chemical'!B6","v":"Kidney Bean"},0.2,37.222572315789478,{"$f":"MROUND(HLOOKUP('Data (HIDE)'!$V$14,'Data (HIDE)'!$C$68:$G$75,4,FALSE)+'Data (HIDE)'!$D$77,0.25)","v":57},{"$f":"HLOOKUP('Data (HIDE)'!$W$14,'Data (HIDE)'!$D$82:$H$90,5,FALSE)","v":21.875},"-",{"$f":"-PMT('Fixed Cost Input'!$C$11,20,(HLOOKUP('Data (HIDE)'!$B$13,'Data (HIDE)'!$C$46:$G$53,4,FALSE)/60*(('Fixed Cost Input'!$C$17*'Fixed Cost Input'!$D$17)+('Fixed Cost Input'!$C$18*'Fixed Cost Input'!$D$18)+('Fixed Cost Input'!$C$19*'Fixed Cost Input'!$D$19))*'Fixed Cost Input'!$D$20),0)","v":6.2793233243638786},"-","-","-","-","-",0,null,null,null,null,null,null,null,null,null,null,null,null,null,{"$f":"MROUND(HLOOKUP('Data (HIDE)'!$V$14,'Data (HIDE)'!$C$68:$G$75,4,FALSE)+'Data (HIDE)'!$D$77,0.25)","v":57},{"$f":"HLOOKUP('Data (HIDE)'!$W$14,'Data (HIDE)'!$D$82:$H$90,5,FALSE)","v":21.875}]
{"$rows_left_out":20}
{"sheet":"Fixed Cost Input","index":6,"n_rows":63,"n_cols":10,"rows_kept":63,"cut":false,"hidden":false,"merged":[[0,0,0,9],[21,0,21,9],[45,0,45,9],[53,0,53,9]]}
["Fixed Costs"]
[]
[null,"Land",null,null,null,null,null,null,"Conventional","Special"]
[null,"  Average Land value ($/acre)",null,3750,null,null,"Machinery",null,"Crop","Crop"]
[null,"  Conventional Crop acres",null,2000,null,null,"  Total Investment ($/acre)",null,{"$f":"ROUND((C44)/(D5+D6),2)","v":600},{"$f":"ROUND((C52)/(D6+D5),2)","v":72}]
[null,"  Special Crop acres",null,500,null,null,"  Residual Value (End of Useful Life)",null,0.25]
[null,"  Owned Land Equity",null,0.85,null,null,"  Useful Life (years)",null,15]
[null,"  Land Financed",null,{"$f":"SUM(1-D7)","v":0.15000000000000002},null,null,"  Owned Equipment Equity",null,0.55000000000000004]
[null,"  Land Opportunity Cost (Investment Rate) ",null,1.4999999999999999E-2,null,null,"  Equipment Financed",null,{"$f":"SUM(1-I8)","v":0.44999999999999996}]
[null,"Land cost ($/acre)",null,null,null,null,"  Machinery Opportunity Cost (Investment Rate) ",null,1.4999999999999999E-2]
[null,"  Finance Rate & Term",7.2499999999999995E-2,25,"Years"]
[null,"  Principle & Interest Cost",null,{"$f":"-PMT(C11,D11,D4*D8,0)","v":49.360445137051194},null,null,"Machinery Cost ($/acre)"]
[null,"  Owned Land Opportunity Cost",null,{"$f":"SUM(D4*D7)*(D9)","v":47.8125},null,null,"  Finance Rate & Term",7.7499999999999999E-2,7,"Years"]
[null,"  Total Cost",null,{"$f":"SUM(D12:D13)","v":97.172945137051187},null,null,"  Principle & Interest Cost",null,{"$f":"-PMT(H13,I13,I5*I9,0)","v":51.416977671004204},{"$f":"-PMT(H13,I13,J5*I9,0)","v":6.170037320520505}]
[null,null,null,null,null,null,"  Machinery Depreciation Cost",null,{"$f":"(I5-(I5*I6))/I7","v":30},{"$f":"(J5-(J5*I6))/I7","v":3.6}]
{"$rows_left_out":49}
{"sheet":"Assumptions","index":7,"n_rows":56,"n_cols":4,"rows_kept":56,"cut":false,"hidden":false,"merged":[[42,0,43,11],[4,0,5,11],[13,0,13,11],[0,0,0,11],[8,0,9,11],[18,0,19,11],[24,0,26,11]]}
["Other Assumptions"]
[]
["Fuel Costs:  Includes fuel used for field work, trucking in inputs and trucking out production."]
[]
["Machinery  Operating Costs:  Includes costs for maintenance, repairs, licenses and insurance, based on 3.2% of machinery investment cost."]
[]
[]
["Crop Insurance: (2022 rates) "]
[{"$f":"IF('Data (HIDE)'!B13=\"Manitoba\",'Data (HIDE)'!B14&\" coverage, $100/acre excess moisture Insurance, and additional hail insurance at $\"&'Data (HIDE)'!W13&\"/acre coverage for all crops.  Coverage and costs based on MASC Risk Areas #2, 5, 6, and 12.\",'Data (HIDE)'!B14&\" coverage, $50/acre excess moisture Insurance, and additional hail insurance at $\"&'Data (HIDE)'!W13&\"/acre coverage for all crops.  Coverage and costs based on MASC \"&'Data (HIDE)'!B13)","v":"80% Insured Value coverage, $100/acre excess moisture Insurance, and additional hail insurance at $400/acre coverage for all crops.  Coverage and costs based on MASC Risk Areas #2, 5, 6, and 12."}]
[]
[]
["Other Costs:  Includes overhead expenses - hydro, telephone, accounting, buildings, supplies and insurance, etc."]
[]
["Land Taxes:  The average cost based on land tax assessment and mill rates of a sample of municipalities growing crops less provincial tax rebate."]
[]
{"$rows_left_out":42}
{"sheet":"Chart data (HIDE)","index":8,"n_rows":12,"n_cols":12,"rows_kept":12,"cut":false,"hidden":true,"merged":[]}
[]
[{"$f":"'Data (HIDE)'!B13&\" Breakeven Yield Risk Ratio - \"&Introduction!I11","v":"Manitoba Breakeven Yield Risk Ratio - 2023"}]
[{"$f":"'Data (HIDE)'!B13&\" Risk & Reward Analysis - \"&Introduction!I11","v":"Manitoba Risk & Reward Analysis - 2023"},null,null,null,"80% Coverage of Total Costs"]
[{"$f":"'Data (HIDE)'!B13&\" - \"&'Data (HIDE)'!B14&\" AgriInsurance Risk Analysis - \"&Introduction!I11","v":"Manitoba - 80% Insured Value AgriInsurance Risk Analysis - 2023"}]
[null,"Operating Costs",{"$f":"'Data (HIDE)'!B14","v":"80% Insured Value"},"80% Coverage of Operating Costs","80% Coverage of Total Costs (Risk)","Return on Asset (Reward)","Return on Investment (Reward)",null,null,null,null,"Target Yield as % of B/E Yield"]
[{"$f":"'Data (HIDE)'!B16","v":"Black Bean"},{"$f":"'Data (HIDE)'!AC16","v":546.21850936066642},{"$f":"'Data (HIDE)'!AJ16","v":564.67600000000004},{"$f":"'Data (HIDE)'!AV16","v":1.0337914045808108},{"$f":"'Data (HIDE)'!AW16","v":0.7370570926818758},{"$f":"'Data (HIDE)'!AS16","v":3.5997623391979552E-2},{"$f":"'Data (HIDE)'!AT16","v":-1.4651306206834988E-3},null,null,null,null,{"$f":"'Data (HIDE)'!AX16","v":0.99853157121879588}]
[{"$f":"'Data (HIDE)'!B17","v":"Kidney Bean"},{"$f":"'Data (HIDE)'!AC17","v":615.02473425029507},{"$f":"'Data (HIDE)'!AJ17","v":655.04399999999998},{"$f":"'Data (HIDE)'!AV17","v":1.0650693598501981},{"$f":"'Data (HIDE)'!AW17","v":0.78455082980146851},{"$f":"'Data (HIDE)'!AS17","v":8.1129049637505488E-3},{"$f":"'Data (HIDE)'!AT17","v":-0.14902912693812412},null,null,null,null,{"$f":"'Data (HIDE)'!AX17","v":0.85098890779975345}]
[{"$f":"'Data (HIDE)'!B18","v":"Hempseed"},{"$f":"'Data (HIDE)'!AC18","v":409.75237315256965},{"$f":"'Data (HIDE)'!AJ18","v":396.24},{"$f":"'Data (HIDE)'!AV18","v":0.96702307530617193},{"$f":"'Data (HIDE)'!AW18","v":0.63982711004884374},{"$f":"'Data (HIDE)'!AS18","v":4.7319680426827306E-2},{"$f":"'Data (HIDE)'!AT18","v":8.9953814059583956E-2},null,null,null,null,{"$f":"'Data (HIDE)'!AX18","v":1.0899578549629414}]
[{"$f":"'Data (HIDE)'!B19","v":"Fababean"},{"$f":"'Data (HIDE)'!AC19","v":304.76437146417436},{"$f":"'Data (HIDE)'!AJ19","v":237.44000000000003},{"$f":"'Data (HIDE)'!AV19","v":0.77909369411939788},{"$f":"'Data (HIDE)'!AW19","v":0.4616722097099954},{"$f":"'Data (HIDE)'!AS19","v":3.8045144399779657E-2},{"$f":"'Data (HIDE)'!AT19","v":2.8573951046948806E-2},null,null,null,null,{"$f":"'Data (HIDE)'!AX19","v":1.0285765395107553}]
[{"$f":"'Data (HIDE)'!B20","v":"Buckwheat"},{"$f":"'Data (HIDE)'!AC20","v":256.41611181251858},{"$f":"'Data (HIDE)'!AJ20","v":151.63200000000001},{"$f":"'Data (HIDE)'!AV20","v":0.59135129586110946},{"$f":"'Data (HIDE)'!AW20","v":0.3254212602342908},{"$f":"'Data (HIDE)'!AS20","v":-7.3306449146355902E-3},{"$f":"'Data (HIDE)'!AT20","v":-0.39908493678378304},null,null,null,null,{"$f":"'Data (HIDE)'!AX20","v":0.60150375939849621}]
[{"$f":"'Data (HIDE)'!B21","v":"Canaryseed"},{"$f":"'Data (HIDE)'!AC21","v":327.42552158413065},{"$f":"'Data (HIDE)'!AJ21","v":434.88000000000005},{"$f":"'Data (HIDE)'!AV21","v":1.3281799106434635},{"$f":"'Data (HIDE)'!AW21","v":0.80988451778728354},{"$f":"'Data (HIDE)'!AS21","v":3.5973423431901706E-2},{"$f":"'Data (HIDE)'!AT21","v":1.0307098279068399E-2},null,null,null,null,{"$f":"'Data (HIDE)'!AX21","v":1.0102985269195672}]
[{"$f":"'Data (HIDE)'!B22","v":"Lentil"},{"$f":"'Data (HIDE)'!AC22","v":278.03680202189071},{"$f":"'Data (HIDE)'!AJ22","v":250.56000000000006},{"$f":"'Data (HIDE)'!AV22","v":0.90117566515627201},{"$f":"'Data (HIDE)'!AW22","v":0.51388835282772938},{"$f":"'Data (HIDE)'!AS22","v":3.1312346896903959E-2},{"$f":"'Data (HIDE)'!AT22","v":-3.0921748439088157E-2},null,null,null,null,{"$f":"'Data (HIDE)'!AX22","v":0.96907571711603058}]

{"sheet":"Data (HIDE)","index":9,"n_rows":110,"n_cols":67,"rows_kept":110,"cut":false,"hidden":true,"merged":[]}
[null,"Annual Update Steps:",null,null,null,null,null,null,null,null,null,"To Do List:"]
[null,"copy & paste 'Green' data blocks below from annual MASC cost and coverage information spreadsheet."]
[null,"enter COP yields into 'yellow' data block below",null,null,null,null,null,null,null,null,null,null,null,null,null,null,null,null,null,null,null,null,null,null,null,null,null,null,null,null,null,null,null,null,null,null,null,null,null,null,null,null,null,null,null,null,null,null,null,null,null,null,null,null,null,{"$f":"V14&\" Yield per Acre - \"&Introduction!I11","v":"Manitoba Yield per Acre - 2023"}]
[null,"enter MASC insured values & COP yields into 'yellow' data blocks below"]
[null,"enter MASC SAR acres into data block below and change formula for 5 year average."]
[null,"select yellow rows and sort"]
[]
[]
[]
[]
[null,"*****Re-sort Yellow rows based on column I for 5yr Avg Ac Ranking or column K for 2018 Ranking ******   *****SUMMARY will AUTO update!! ******",null,null,null,null,null,null,null,null,null,null,null,null,"****sort on column F to reset to original listing ****"]
[null,null,null,null,null,null,null,null,null,null,null,null,null,null,null,null,null,null,null,null,null,null,"Hail Ins. coverage / acre "]
[null,"Manitoba",null,null,null,null,null,null,null,null,null,null,null,null,null,null,null,null,null,null,null,null,400]
[null,"80% Insured Value",null,null,"**Change Mkt Prices Here***",null,null,null,null,"**Change yr for Risk pg***",null,null,null,null,null,null,null,null,null,null,null,{"$f":"B13","v":"Manitoba"},{"$f":"B13","v":"Manitoba"},null,null,null,null,null,null,null,null,null,null,null,null,{"$f":"V14","v":"Manitoba"},null,null,null,null,null,null,null,null,null,null,null,"AgriInsurance Insured Value"]
[null,null,"Yield","Unit","Price","Default RANK","Manual Rank","5 yr Avg Acres","5 yr Avg Acres RANK","2022 Acres","2020 Acres RANK","Seed & Treatment","Fertilizer","Herbicide","Fungicide","Insecticide","Fuel","Machinery Operating","Machinery Lease","Rental and Custom","Labour","Crop Insurance","Hail Insurance","Other Costs","Land Taxes","Storage Costs","Drying Costs","Interest on Operating","Total Operating","Land Investment Costs","Machinery Costs","Total Fixed ","Total Operating & Fixed","Labour","Total Costs","Insured value","% Premium","Gross Revenue","Margin Over Total Costs (Net Profit)","Operating Expense Ratio","B/E Price Over Total Costs","Breakeven Yield Over Total Costs","B/E Yield Risk Ratio","AgriInsurance Risk Ratio","Estimated ROA (Reward)","Estimated ROI (Reward)",null,"% of Op Cost","% of Total Costs","Target or Average Yield as % of B/E Yield"]
{"$rows_left_out":95}